{"text_format":"1","workbook":"xlsx","n_sheets":9,"sheets":["Navigation Pane","General Input Sheet","Existing Trunk Assets - Pathway","Exist Trunk Assets - Ferry","Future Trunk Assets - Pathway","Future Trunk Assets - Ferry","Catchment Demand - Pathway","Catchment Demand - Ferry","Summary Cost Schedule"],"not_rendered":{"charts":0,"images":0,"macros":1,"external_links":2,"defined_names":28,"comments":0,"pivot_tables":0},"unopened":[],"bounds":{"document_bytes":16777216,"sheet_cells":100000,"rows_first":2000,"rows_last":500,"rows_between":2000,"halvings":0,"cell_chars":16384,"cell_head_chars":4096},"cells_cut":0,"cells_raw":0,"read":"whole","date_system":"1900"}

{"sheet":"Navigation Pane","index":0,"n_rows":23,"n_cols":18,"rows_kept":23,"cut":false,"hidden":false,"merged":[[17,2,17,5],[14,12,14,15],[22,2,22,5],[21,2,21,5],[18,2,18,5],[20,2,20,5],[1,1,1,15],[2,1,2,15],[3,5,3,6],[11,7,11,10],[12,7,22,10],[11,12,11,15],[9,3,9,4],[9,8,9,9],[9,13,9,14],[11,2,11,5],[12,2,12,5],[14,2,14,5],[15,2,15,5],[12,12,12,15],[7,3,8,15],[15,12,15,15]]}
[]
[null,"Brisbane City Council"]
[null,"Local Government Infrastructure Plan (LGIP)"]
[]
[]
[null,"Version No",null,1,null,"Date","2021-12-10",null,null,"Author ","BCC",null,null,null,null,null," "]
[]
[null,"Comments",null,"Version for LGIP amendment 1a adoption. Effective as at 10 December 2021."]
[]
[null,null,null,"Inputs",null,null,null,null,"Calculation",null,null,null,null,"Outputs"]
[]
[null,null,"General Input Sheet",null,null,null,null,"Calculation Function",null,null,null,null,"Summary Cost Schedule",null,null,null,null," "]
[null,null,"l Financial Inputs\nl Other \"generic\" inputs",null,null,null,null,"Catchment based summary of demand, infrastructure (existing and new) and cost allocation\n\nInfrastructure Cost calculation for each catchment\n\nOptional Discounted Cashflow",null,null,null,null,"l Summary of demand and cost allocation by catchment \nl Final costs by catchment",null,null,null,null," "]
[]
[null,null,null,null,null,null,null,null,null,null,null,null,"Summary Cash flow Projections"]
{"$rows_left_out":9}
{"sheet":"General Input Sheet","index":1,"n_rows":51,"n_cols":9,"rows_kept":51,"cut":false,"hidden":false,"merged":[[1,1,1,11],[3,1,3,10],[24,1,29,1],[20,1,22,1],[5,1,5,2],[15,1,15,2],[11,1,11,2]]}
[]
[null,{"$f":"'Navigation Pane'!B2","v":"Brisbane City Council"}]
["Return to Navigation Pane"]
[null,"General Input Sheet"]
[]
[null,"General Inputs",null,null,"Reference",null,"Value",null,"Comments"]
[]
[null,null,"Base Year",null,"YEAR",null,2016]
[null,null,null,null,null,null,{"$f":"YEAR","v":2016}]
[null,null,"Term (between 15 and 30 years)",null,"TERM",null,10]
[]
[null,"Application of Discounted Cash flow"]
[null,null," "]
[null,null,"Calculate charges using Discounted Cash flow? (Y/N)",null,"DCFTRIGGER",null,"Yes"]
[]
{"$rows_left_out":37}
{"sheet":"Existing Trunk Assets - Pathway","index":2,"n_rows":1538,"n_cols":21,"rows_kept":1538,"cut":false,"hidden":false,"merged":[[9,17,9,19],[6,1,6,2],[9,1,9,5],[9,6,9,7],[9,8,9,12],[9,13,9,16]]}
[]
[null,{"$f":"'Navigation Pane'!B2","v":"Brisbane City Council"}]
[null,"Pathway"]
[]
[null,"EXISTING TRUNK ASSETS"]
[]
[null,"Land Valuation Type",null,"Location"]
[]
[null,null,null,null,null,null,null,"Asset Data",null,null,null,null,null,null,null,null,null,null,null,null,"Catchment Asset Allocation"]
[null,"Basic Asset Data",null,null,null,null,"Asset Attributes",null,null,"Basic Asset Valuation",null,null,null,null,"Land Attributes",null,null,null,"Refined Asset Value",null,"Citywide"]
[null,"Asset ID","LGIP ID","Asset Class","Asset Name","Description","Unit Rate Type (*)","Surface Area (m2)","Hiercahy/name","Unit Rate","Baseline Valuation","Site/Condition","Multiplier","Gross Value","Land Location/Type","Size of land (ha) (*)","Unit Cost","Land Value","Valuation Year","Escalation","Current Replacement Cost"]
[null,"Councils ID (from GIS, FAR, AMA etc.)","ID from the LGIP drawings","Arterial, Subarterial, Collector",null,null,null,null,null,null,"May be calculated from unit rates OR unique values can be direct entered"]
[null,"BK9001S00164",null,"Primary cycle route","ALICE ST",null,"PAVER",17.436582000000001,null,151.88,{"$f":"J13*H13","v":2648.2680741600002},null,null,null,null,0,{"$f":"IFERROR(R13/P13,0)","v":0},0,2016,1,{"$f":"R13+K13","v":2648.2680741600002}]
[null,"BK9001S00165",null,"Primary cycle route","ALICE ST",null,"PAVER",7.8325699999999996,null,151.88,{"$f":"J14*H14","v":1189.6107316},null,null,null,null,0,{"$f":"IFERROR(R14/P14,0)","v":0},0,2016,1,{"$f":"R14+K14","v":1189.6107316}]
[null,"BK9001S00166",null,"Primary cycle route","ALICE ST",null,"CONCRETE",124.402067,null,148.52000000000001,18476.194990840002,null,null,null,null,0,0,0,2016,1,18476.194990840002]
{"$rows_left_out":1524}
{"sheet":"Exist Trunk Assets - Ferry","index":3,"n_rows":40,"n_cols":27,"rows_kept":40,"cut":false,"hidden":false,"merged":[[9,25,9,26],[9,20,9,21],[7,1,7,2],[10,1,10,5],[10,6,10,7],[10,8,10,12],[10,13,10,16],[10,26,11,26],[10,25,11,25],[10,23,11,23],[10,17,10,19],[10,20,11,20],[10,21,11,21]]}
[]
[null,"Brisbane City Council"]
[null,"Ferry"]
[]
[null,"EXISTING TRUNK ASSETS"]
[]
[]
[null,"Land Valuation Type",null,"Location"]
[]
[null,null,null,null,null,null,null,"Asset Data",null,null,null,null,null,null,null,null,null,null,null,null,"Catchment Asset Allocation",null,null,"Asset Usage",null,"Cost Allocation"]
[null,"Basic Asset Data",null,null,null,null,"Asset Attributes",null,null,"Basic Asset Valuation",null,null,null,null,"Land Attributes",null,null,null,"Refined Asset Value",null,"Catchment","Totals",null,"Catchment",null,{"$f":"V11","v":"Totals"},"Check"]
[null,"Asset ID","LGIP ID","Asset Class","Asset Name","Description","Unit Rate Type (*)","Length/unit (*)","Hiercahy/name","Unit Rate","Baseline Valuation","Site/Condition","Multiplier","Gross Value","Land Location/Type","Size of land (ha) (*)","Unit Cost","Land Value","Valuation Year","Escalation","Current Replacement Cost"]
[null,"Councils ID (from GIS, FAR, AMA etc.)","ID from the LGIP drawings","Arterial, Subarterial, Collector",null,null,null,null,null,null,"May be calculated from unit rates OR unique values can be direct entered",null,null,null,null,null,null,null,null,null,"CRC",{"$f":"IFERROR(VLOOKUP(V11,Roadcatch,6,FALSE),\"\")","v":""},"",{"$f":"V13","v":""},null,{"$f":"SUM(Z14:Z39)","v":136452500}]
[null,"Apollo Road",null,null,null,"Apollo Rd, Bulimba (CityCat)",null,null,null,null,1750000,null,{"$f":"IF(L14=\"\",1,VLOOKUP(L14,Roadsitecond,2,FALSE))","v":1},{"$f":"IF(K14=\"\",\"\",K14*M14)","v":1750000},null,null,null,null,2016,1,{"$f":"IFERROR((N14+R14)*T14,0)","v":1750000},"y",null,1,null,{"$f":"IF(X14=\"\",\"\",(X14/$X14)*$U14)","v":1750000}]
[null,"Bretts Wharf",null,null,null,"Kingsford Smith Drive, Hamilton (CityCat)",null,null,null,null,6435000,null,1,{"$f":"IF(K15=\"\",\"\",K15*M15)","v":6435000},null,null,null,null,2016,1,{"$f":"IFERROR((N15+R15)*T15,0)","v":6435000},"y",null,1,null,6435000,{"$f":"IF(SUM(Z15:Z15)=U15,\"\",\"ERROR\")","v":""}]
{"$rows_left_out":26}
{"sheet":"Future Trunk Assets - Pathway","index":4,"n_rows":108,"n_cols":37,"rows_kept":108,"cut":false,"hidden":false,"merged":[[5,1,5,2],[12,35,12,36],[13,35,13,36],[7,4,7,24],[8,4,8,24],[7,1,7,3],[13,24,13,34],[12,33,12,34],[10,1,10,2],[13,1,13,5],[13,6,13,8],[13,9,13,12],[13,13,13,23]]}
[]
[null,{"$f":"'Navigation Pane'!B2","v":"Brisbane City Council"}]
[]
[null,"Pathway"]
["Return to \"Future Trunk Assets\""]
[null,"Future Trunk Assets - Pathway"]
[]
[null,"Data Refernces",null,null,"Insert references to relevant data sources which support the scope, values and timing entered in the Spreadsheet below"]
[]
[]
[null,"Land Valuation Type",null,"Location"]
[]
[null,null,null,null,null,null,null,"Asset Data",null,null,null,null,null,null,null,null,null,null,null,null,null,null,null,null,null,null,null,null,null,null,null,null,null,null,null,"Catchment Asset Allocation"]
[null,"Basic Asset Data",null,null,null,null,"Asset Attributes",null,null,"Land Attributes",null,null,null,"Basic Asset Valuation",null,null,null,null,null,null,null,null,null,null,"Refined Asset Value",null,null,null,null,null,null,null,null,null,null,"Citywide"]
[null,"Asset ID","LGIP ID","Project Type","Service Catchment","Description","Unit Rate Type (*)","Length/unit (*)","Hiercahy/name","Land Location/Type","Size of land (m2) (*)","Unit Cost","Land Value","Unit Rate","Baseline Valuation","Valuation Year","Base Est Escalation","Site/Condition","Indirect costs - indirect and overhead costs to deliver the project (17%of construction cost) ($)","Project owners costs – master planning, survey, geotechnical, design, project management, environments (13% of indirect and construction costs) ($)","Construction Contingency Rate","Construction Contingency Cost ($)","Grants and Subsidies ($)","Gross Value","Year provided (*)","Escalation","Total construction cost","Spare Capacity %","Share of the total Cost with the same year of provision %"," Terminal Value Analysis","Final Terminal value adjustment %","Gross Cost of the trunk infrastructure","Gross Cost (escalated)","Present Day Value","NPV Total Asset Cost after Terminal Value Adjustment","Cost Allocation","Cost Allocation for Service Cost Schedule"]
{"$rows_left_out":94}
{"sheet":"Future Trunk Assets - Ferry","index":5,"n_rows":28,"n_cols":45,"rows_kept":28,"cut":false,"hidden":false,"merged":[[1,1,1,3],[3,1,3,2],[14,40,15,40],[14,42,15,42],[14,39,15,39],[14,44,15,44],[8,1,8,3],[8,4,8,26],[9,4,9,26],[14,26,14,36],[13,35,13,36],[11,1,11,2],[14,1,14,5],[14,6,14,8],[14,9,14,12],[14,13,14,25],[14,37,15,37]]}
[]
[null,{"$f":"'Navigation Pane'!B2","v":"Brisbane City Council"}]
[]
[null,"Transport"]
["Return to \"Future Trunk Assets\""]
[null,"Future Trunk Assets - Ferry"]
[]
[]
[null,"Data Refernces",null,null,"Insert references to relevant data sources which support the scope, values and timing entered in the Spreadsheet below"]
[]
[]
[null,"Land Valuation Type",null,"Location"]
[]
[null,null,null,null,null,null,null,"Asset Data",null,null,null,null,null,null,null,null,null,null,null,null,null,null,null,null,null,null,null,null,null,null,null,null,null,null,null,null,null,"Catchment Asset Allocation",null,"Asset Usage",null,null,"Cost Allocation",null,"Cost Allocation for Service Cost Schedule"]
[null,"Basic Asset Data",null,null,null,null,"Asset Attributes",null,null,"Land Attributes",null,null,null,"Basic Asset Valuation",null,null,null,null,null,null,null,null,null,null,null,null,"Refined Asset Value",null,null,null,null,null,null,null,null,null,null,"Citywide",null,{"$f":"AL15","v":"Citywide"},"TOTALS",null,{"$f":"AL15","v":"Citywide"},null,"Citywide"]
{"$rows_left_out":14}
{"sheet":"Catchment Demand - Pathway","index":6,"n_rows":48,"n_cols":34,"rows_kept":48,"cut":false,"hidden":false,"merged":[[1,1,1,11],[2,1,2,11],[4,1,4,11]]}
[]
[null,{"$f":"'Navigation Pane'!B2","v":"Brisbane City Council"}]
[null,"Pathway network"]
[]
[null,"Catchment Demand (Person trips per day)"]
[]
[null,"Catchment No","Catchment Name (*)",2016,{"$f":"D7+5","v":2021},{"$f":"E7+5","v":2026},2031,2036,null,{"$f":"\"NPV Future Demand (\"&(D7+1)& \" - \" & F7 &\")\"","v":"NPV Future Demand (2017 - 2026)"},null,{"$f":" \"Ultimate Demand\"","v":"Ultimate Demand"},"Spare Capacity"]
[null,1,"Citywide",2886302,3095529,3302455,null,null,null,{"$f":"NPV(5.91%,E43:N43)","v":307844.98115804599},null,4638511,{"$f":"(L8-F8)/F8","v":0.40456448308909582}]
[]
[]
[]
[]
[]
[]
[]
{"$rows_left_out":34}
{"sheet":"Catchment Demand - Ferry","index":7,"n_rows":18,"n_cols":34,"rows_kept":18,"cut":false,"hidden":false,"merged":[[1,1,1,11],[3,1,3,11],[5,1,5,11]]}
[]
[null,{"$f":"'Navigation Pane'!B2","v":"Brisbane City Council"}]
[]
[null,"Ferry network"]
[]
[null,"Catchment Demand (Person trips per day)"]
[]
[null,"Catchment No","Catchment Name (*)",2016,{"$f":"D8+5","v":2021},{"$f":"E8+5","v":2026},2031,2036,null,{"$f":"\"NPV Future Demand (\"&(D8+1)& \" - \" &H8+10&\")\"","v":"NPV Future Demand (2017 - 2046)"},null,{"$f":" \"Ultimate Demand\"","v":"Ultimate Demand"},"Spare Capacity"]
[null,1,"Citywide",89178,95637,102026,null,null,null,{"$f":"NPV(5.91%,E18:N18)","v":9504.0687826367721},null,143275,{"$f":"(L9-F9)/F9","v":0.40429890420088999}]
[]
[]
[]
[null,null,"Totals",{"$f":"SUM(D9:D12)","v":89178},{"$f":"SUM(E9:E12)","v":95637},{"$f":"SUM(F9:F12)","v":102026},{"$f":"SUM(G9:G12)","v":0},null,null,{"$f":"SUM(J9:J12)","v":9504.0687826367721},null,{"$f":"SUM(L9:L12)","v":143275}]
[]
[]
{"$rows_left_out":4}
{"sheet":"Summary Cost Schedule","index":8,"n_rows":14,"n_cols":11,"rows_kept":14,"cut":false,"hidden":false,"merged":[[6,10,7,10],[12,1,12,10],[6,9,7,9],[8,1,8,10],[1,1,1,9],[2,1,2,9],[4,1,4,9],[6,3,6,5],[6,6,6,8],[6,1,6,2]]}
[]
[null,{"$f":"'Navigation Pane'!B2","v":"Brisbane City Council"}]
[]
["Return to Navigation Pane"]
[null,"Summary Cost Schedule"]
[]
[null,"Catchment",null,"Demand (trips)",null,null,"Cost of Trunk Infrastrcutrue ",null,null,"Cost per Unit Demand (Average)","Cost per Unit Demand (Marginal)"]
[null,"No","Name","Existing (A)","NPV Future (B)","TOTAL (A)+ (B)","Existing (C)","NPV Future (D)","TOTAL (C)+ (D)"]
[null,"Ferry"]
[null,1,"Citywide",{"$f":"IFERROR(VLOOKUP($C10,'Catchment Demand - Ferry'!$C$9:$J$12,2,FALSE),\"\")","v":89178},{"$f":"IFERROR(VLOOKUP($C10,'Catchment Demand - Ferry'!$C$9:$J$12,8,FALSE),\"\")","v":9504.0687826367721},{"$f":"IFERROR(D10+E10,\"\")","v":98682.068782636779},{"$f":"'Exist Trunk Assets - Ferry'!N40","v":136452500},{"$f":"'Future Trunk Assets - Ferry'!AK28","v":91484722.782349601},{"$f":"G10+H10","v":227937222.78234959},{"$f":"IFERROR(I10/F10,0)","v":2309.8139874268159},{"$f":"H10/E10","v":9625.8481366933502}]
[]
[]
[null,"Pathway"]
[null,{"$f":"'Catchment Demand - Pathway'!B8","v":1},{"$f":"'Catchment Demand - Pathway'!C8","v":"Citywide"},{"$f":"IFERROR(VLOOKUP($C14,'Catchment Demand - Pathway'!$C$8:$J$37,2,FALSE),\"\")","v":2886302},{"$f":"IFERROR(VLOOKUP($C14,'Catchment Demand - Pathway'!$C$8:$J$37,8,FALSE),\"\")","v":307844.98115804599},{"$f":"IFERROR(D14+E14,\"\")","v":3194146.9811580461},{"$f":"'Existing Trunk Assets - Pathway'!U1538","v":217143169.6866301},{"$f":"'Future Trunk Assets - Pathway'!AI108","v":172031037.43597567},{"$f":"G14+H14","v":389174207.1226058},{"$f":"IFERROR(I14/F14,0)","v":121.83979303967712},{"$f":"H14/E14","v":558.82358968085907}]