{"text_format":"1","workbook":"xlsx","n_sheets":8,"sheets":["Coversheet","Modelling inputs","Growth (Residential)","Growth (Non-Residential)","Growth (Impervious Area)","BAICR Charge Lookup","Adopted Charge Revenue Forecast","LGIP Cash Flow Analysis"],"not_rendered":{"charts":2,"images":0,"macros":1,"external_links":0,"defined_names":11,"comments":0,"pivot_tables":0},"unopened":[],"bounds":{"document_bytes":16777216,"sheet_cells":100000,"rows_first":2000,"rows_last":500,"rows_between":2000,"halvings":0,"cell_chars":16384,"cell_head_chars":4096},"cells_cut":0,"cells_raw":0,"read":"whole","date_system":"1900"}

{"sheet":"Coversheet","index":0,"n_rows":45,"n_cols":6,"rows_kept":45,"cut":false,"hidden":false,"merged":[[44,2,44,4]]}
[null,"Brisbane City Council"]
[null,"Local Government Infrastructure Plan (LGIP)"]
[]
[]
[null,"Anticipated Charges Revenue and Future Cash Flows Model"]
[]
[null,"Version:","LGIP A1a"]
[null,"Date:","Effective 10 December 2021"]
[null,"Author:","Brisbane City Council"]
[]
[]
[null,"Model flow diagram (click to follow)"]
[]
[]
[]
[]
[]
[]
[]
[]
{"$rows_left_out":26}
{"sheet":"Modelling inputs","index":1,"n_rows":44,"n_cols":7,"rows_kept":44,"cut":false,"hidden":false,"merged":[[15,1,23,1]]}
["Local Government Infrastructure Plan"]
["Brisbane City Council"]
[{"$f":"Coversheet!C8","v":"Effective 10 December 2021"}]
["Input"]
["Formula",null,"General modelling inputs"]
[]
[null,null,"Model parameters",null,"Value",null,"BCC Comment/Source"]
[]
[null,null,"Modelling timframes"]
[]
[null,null,"Modelling start year:",null,2016,null,"Base values for all costs"]
[null,null,"Modelling end year:",null,2026,null,"N/A"]
[null,null,"Modelling term (years):",null,{"$f":"E12-E11","v":10},null,"N/A"]
[]
[null,null,"Financial inputs"]
[]
[null,null,"Average 10 Year Bond Rate:",null,null,null,"Not used"]
[null,null,"Basic Margin on 10 Yr. Bond Rate:",null,null,null,"Not used"]
[]
[null,null,"Calculated WACC:",null,{"$f":"E18+E17","v":0},null,"Not used"]
{"$rows_left_out":25}
{"sheet":"Growth (Residential)","index":2,"n_rows":51,"n_cols":17,"rows_kept":51,"cut":false,"hidden":false,"merged":[]}
["Local Government Infrastructure Plan"]
["Brisbane City Council"]
[{"$f":"Coversheet!C8","v":"Effective 10 December 2021"},null,null,"Input"]
[null,null,null,"Formula"]
[1.1000000000000001,"Anticipated Residential Growth - Census Year"]
[]
[null,"Development type(1)","Unit of demand(2)",2016,2021,2026]
[null,"Attached Dwelling","Number of dwellings: 1 or 2 bedroom dwelling",98722,120784,136797]
[null,"Attached Dwelling","Number of dwellings: 3 or more bedroom dwelling",45200,52988,58110]
[null,"Detached Dwelling","Number of dwellings: 1 or 2 bedroom dwelling",28101,28285,28513]
[null,"Detached Dwelling","Number of dwellings: 3 or more bedroom dwelling",281996,284884,290495]
[null,"Short term accommodation","Number of bedrooms: Bedroom that is not within a suite",10909,11835,12468]
[null,"Short term accommodation","Number of suites: Suite with 1 or 2 bedrooms",5615,6219,6739]
[null,"Short term accommodation","Number of suites: Suite with 3 or more bedrooms",1685,1858,2006]
[null,"Long term accommodation","Number of bedrooms: Bedroom that is not within a suite",510,534,556]
[null,"Long term accommodation","Number of suites: Suite with 1 or 2 bedrooms",1673,1752,1823]
[null,"Long term accommodation","Number of suites: Suite with 3 or more bedrooms",341,357,372]
[]
[1.2,"Anticipated Residential Growth - Annualised"]
[]
{"$rows_left_out":32}
{"sheet":"Growth (Non-Residential)","index":3,"n_rows":60,"n_cols":17,"rows_kept":60,"cut":false,"hidden":false,"merged":[]}
["Local Government Infrastructure Plan"]
["Brisbane City Council"]
[{"$f":"Coversheet!C8","v":"Effective 10 December 2021"},null,null,"Input"]
[null,null,null,"Formula"]
[2.1,"Anticipated Non Residential Growth - Census Year"]
[]
[null,"Development type(1)","Unit of demand(2)",2016,2021,2026]
[null,"Food Services, Arts & Recreation","m2 GFA",1329423,1450071,1541614]
[null,"Community - Education","m2 GFA",3341563,3754708,4194896]
[null,"Community - Health","m2 GFA",1710389,1902219,2068717]
[null,"Community - Other","m2 GFA",1016836,1132432,1253052]
[null,"Industry - General","m2 GFA",549703,587701,630370]
[null,"Industry - Heavy","m2 GFA",350643,391639,447057]
[null,"Industry - Light","m2 GFA",6559591,6854829,7153262]
[null,"Industry - Other","m2 GFA",128868,135382,143945]
[null,"Office","m2 GFA",6128313,6616538,7170238]
[null,"Retail","m2 GFA",3590588,3836609,4126138]
[null,"Showroom, Retail Warehouse & Bulky Goods","m2 GFA",921490,978076,1028868]
[null,"Warehouse, Bulk Stores & Logistics","m2 GFA",8403730,9052226,9897985]
[null,"Rural","m2 GFA",4666,5149,5260]
{"$rows_left_out":41}
{"sheet":"Growth (Impervious Area)","index":4,"n_rows":23,"n_cols":17,"rows_kept":23,"cut":false,"hidden":false,"merged":[]}
["Local Government Infrastructure Plan"]
["Brisbane City Council"]
[{"$f":"Coversheet!C8","v":"Effective 10 December 2021"},null,null,"Input"]
[null,null,null,"Formula"]
[3.1,"Anticipated Impervious Area Growth - Census Year"]
[]
[null,"Development type(1)","Unit of demand(2)",2016,2021,2026]
[null,"Non-residential Stormwater Impervious Area","Impervious area in m2",50334875.407358818,52236427.725723013,54436481.207498044]
[]
[3.2,"Anticipated Non Residential Growth - Annualised"]
[]
[null,"Development type","Unit of demand",2016,2017,2018,2019,2020,2021,2022,2023,2024,2025,2026,null,"Charge Code","Applied Charge"]
[null,"Non-residential Stormwater Impervious Area","Impervious area in m2",{"$f":"D8","v":50334875.407358818},{"$f":"($E8-$D8)/5","v":380310.46367283911},{"$f":"($E8-$D8)/5","v":380310.46367283911},380310.46367283911,380310.46367283911,380310.46367283911,{"$f":"($F8-$E8)/5","v":440010.69635500608},{"$f":"($F8-$E8)/5","v":440010.69635500608},440010.69635500608,440010.69635500608,440010.69635500608,null,"W01",{"$f":"IFERROR(IF('Modelling inputs'!$E$30=\"Default\",VLOOKUP(P13,'BAICR Charge Lookup'!A:F,6,FALSE),IF('Modelling inputs'!$E$30=\"Alternate charge\",VLOOKUP(P13,'BAICR Charge Lookup'!A:G,7,FALSE))),0)","v":10}]
[]
[2.2999999999999998,"Anticipated Revenue - Applied Charge (3)"]
[]
[null,"Development type","Unit of demand",2016,2017,2018,2019,2020,2021,2022,2023,2024,2025,2026]
[null,"Non-residential Stormwater Impervious Area","Impervious area in m2","N/A",{"$f":"E13*$Q13","v":3803104.6367283911},{"$f":"F13*$Q13","v":3803104.6367283911},3803104.6367283911,3803104.6367283911,3803104.6367283911,4400106.963550061,4400106.963550061,4400106.963550061,4400106.963550061,4400106.963550061]
[]
["Notes:"]
{"$rows_left_out":4}
{"sheet":"BAICR Charge Lookup","index":5,"n_rows":141,"n_cols":7,"rows_kept":141,"cut":false,"hidden":false,"merged":[]}
["Local Government Infrastructure Plan"]
["Brisbane City Council"]
[{"$f":"Coversheet!C8","v":"Effective 10 December 2021"}]
[]
["Charges categories, sub-categories, demand units, and applied adopted charge (AAC) rate - Lookup table"]
["Brisbane Adopted Infrastructure Charges Resolution (No.5) 2015"]
[]
["4.1 Reconfiguration of a Lot"]
["Code","Category","Sub Category","Demand Unit",null,"AICR5 Charge","Alt. Charge"]
["A01","01 Residential (Reconfiguration of a Lot)","Residential Lot","Number of residential lots",null,14000,0]
["A02","02 Non-Residential (Reconfiguration of a Lot)","Non-Residential Lot","Number of non-residential lots",null,14000,0]
[]
["4.2 Material Change of Use (Residential - Transport, Community Purposes, and Waterways)"]
["Code","Category","Sub Category","Demand Unit",null,"AICR5 Charge","Alt. Charge"]
["B01","01 Residential (Material Change of Use/Building Work)","Caretaker's accommodation - 1 or 2 bedroom dwelling","Number of dwellings: 1 or 2 bedroom dwelling",null,10000,0]
["B02","01 Residential (Material Change of Use/Building Work)","Caretaker's accommodation - 3 or more bedroom dwelling","Number of dwellings: 3 or more bedroom dwelling",null,14000,0]
["B11","01 Residential (Material Change of Use/Building Work)","Dwelling house - 1 or 2 bedroom dwelling","Number of dwellings: 1 or 2 bedroom dwelling",null,10000,0]
["B12","01 Residential (Material Change of Use/Building Work)","Dwelling house - 3 or more bedroom dwelling","Number of dwellings: 3 or more bedroom dwelling",null,14000,0]
["B21","01 Residential (Material Change of Use/Building Work)","Dual occupancy - 1 or 2 bedroom dwelling","Number of dwellings: 1 or 2 bedroom dwelling",null,10000,0]
["B22","01 Residential (Material Change of Use/Building Work)","Dual occupancy - 3 or more bedroom dwelling","Number of dwellings: 3 or more bedroom dwelling",null,14000,0]
{"$rows_left_out":122}
{"sheet":"Adopted Charge Revenue Forecast","index":6,"n_rows":45,"n_cols":16,"rows_kept":45,"cut":false,"hidden":false,"merged":[]}
["Local Government Infrastructure Plan"]
["Brisbane City Council"]
[{"$f":"Coversheet!C8","v":"Effective 10 December 2021"},null,null,null,null,null,null,null,"Input"]
[null,null,null,null,null,null,null,null,"Formula"]
[5.0999999999999996,"Anticipated infrastructure charges revenue ($'000)"]
[null,{"$f":"IF('Modelling inputs'!E30=\"Default\",\"Brisbane Adopted Infrastructure Charge Resolution (No.5) 2015\",IF('Modelling inputs'!E30=\"Alternate charge\",\"Alternate charging scenario: \"&'Modelling inputs'!G30,\"ERROR\"))","v":"Brisbane Adopted Infrastructure Charge Resolution (No.5) 2015"}]
[]
[null,null,null,"Model year",null,0,1,2,3,4,5,6,7,8,9,10]
[null,"Development type",null,"2016 NPV",null,"2016 (1)",2017,2018,2019,2020,2021,2022,2023,2024,2025,2026]
[null,"Residential",null,{"$f":"F10+NPV(WACC,G10:P10)","v":523242.82341587829},null,0,{"$f":"HLOOKUP(G9,'Growth (Residential)'!$E$35:$N$46,12,FALSE)/1000","v":76019.600000000006},{"$f":"HLOOKUP(H9,'Growth (Residential)'!$E$35:$N$46,12,FALSE)/1000","v":76019.600000000006},{"$f":"HLOOKUP(I9,'Growth (Residential)'!$E$35:$N$46,12,FALSE)/1000","v":76019.600000000006},{"$f":"HLOOKUP(J9,'Growth (Residential)'!$E$35:$N$46,12,FALSE)/1000","v":76019.600000000006},{"$f":"HLOOKUP(K9,'Growth (Residential)'!$E$35:$N$46,12,FALSE)/1000","v":76019.600000000006},{"$f":"HLOOKUP(L9,'Growth (Residential)'!$E$35:$N$46,12,FALSE)/1000","v":63819.199999999997},{"$f":"HLOOKUP(M9,'Growth (Residential)'!$E$35:$N$46,12,FALSE)/1000","v":63819.199999999997},{"$f":"HLOOKUP(N9,'Growth (Residential)'!$E$35:$N$46,12,FALSE)/1000","v":63819.199999999997},{"$f":"HLOOKUP(O9,'Growth (Residential)'!$E$35:$N$46,12,FALSE)/1000","v":63819.199999999997},{"$f":"HLOOKUP(P9,'Growth (Residential)'!$E$35:$N$46,12,FALSE)/1000","v":63819.199999999997}]
[null,"Non-residential",null,{"$f":"F11+NPV(WACC,G11:P11)","v":290492.16200997325},null,0,{"$f":"HLOOKUP(G9,'Growth (Non-Residential)'!$E$41:$N$55,15,FALSE)/1000","v":38274.733599999985},{"$f":"HLOOKUP(H9,'Growth (Non-Residential)'!$E$41:$N$55,15,FALSE)/1000","v":38274.733599999985},{"$f":"HLOOKUP(I9,'Growth (Non-Residential)'!$E$41:$N$55,15,FALSE)/1000","v":38274.733599999985},{"$f":"HLOOKUP(J9,'Growth (Non-Residential)'!$E$41:$N$55,15,FALSE)/1000","v":38274.733599999985},{"$f":"HLOOKUP(K9,'Growth (Non-Residential)'!$E$41:$N$55,15,FALSE)/1000","v":38274.733599999985},{"$f":"HLOOKUP(L9,'Growth (Non-Residential)'!$E$41:$N$55,15,FALSE)/1000","v":40667.287200000006},{"$f":"HLOOKUP(M9,'Growth (Non-Residential)'!$E$41:$N$55,15,FALSE)/1000","v":40667.287200000006},{"$f":"HLOOKUP(N9,'Growth (Non-Residential)'!$E$41:$N$55,15,FALSE)/1000","v":40667.287200000006},{"$f":"HLOOKUP(O9,'Growth (Non-Residential)'!$E$41:$N$55,15,FALSE)/1000","v":40667.287200000006},{"$f":"HLOOKUP(P9,'Growth (Non-Residential)'!$E$41:$N$55,15,FALSE)/1000","v":40667.287200000006}]
[null,"Non-residential (Stormwater)",null,{"$f":"F12+NPV(WACC,G12:P12)","v":30002.748437234364},null,0,{"$f":"HLOOKUP(G9,'Growth (Impervious Area)'!$E$17:$N$18,2,FALSE)/1000","v":3803.1046367283911},{"$f":"HLOOKUP(H9,'Growth (Impervious Area)'!$E$17:$N$18,2,FALSE)/1000","v":3803.1046367283911},{"$f":"HLOOKUP(I9,'Growth (Impervious Area)'!$E$17:$N$18,2,FALSE)/1000","v":3803.1046367283911},{"$f":"HLOOKUP(J9,'Growth (Impervious Area)'!$E$17:$N$18,2,FALSE)/1000","v":3803.1046367283911},{"$f":"HLOOKUP(K9,'Growth (Impervious Area)'!$E$17:$N$18,2,FALSE)/1000","v":3803.1046367283911},{"$f":"HLOOKUP(L9,'Growth (Impervious Area)'!$E$17:$N$18,2,FALSE)/1000","v":4400.1069635500608},{"$f":"HLOOKUP(M9,'Growth (Impervious Area)'!$E$17:$N$18,2,FALSE)/1000","v":4400.1069635500608},{"$f":"HLOOKUP(N9,'Growth (Impervious Area)'!$E$17:$N$18,2,FALSE)/1000","v":4400.1069635500608},{"$f":"HLOOKUP(O9,'Growth (Impervious Area)'!$E$17:$N$18,2,FALSE)/1000","v":4400.1069635500608},{"$f":"HLOOKUP(P9,'Growth (Impervious Area)'!$E$17:$N$18,2,FALSE)/1000","v":4400.1069635500608}]
[null,"Total revenue",null,843737.73386308574,null,0,{"$f":"SUM(G10:G12)","v":118097.43823672837},{"$f":"SUM(H10:H12)","v":118097.43823672837},118097.43823672837,118097.43823672837,118097.43823672837,108886.59416355006,108886.59416355006,108886.59416355006,108886.59416355006,108886.59416355006]
[]
[null,"Notes:"]
[null,"(1) Optional: Enter expected charges revenue for base year"]
[]
[]
[]
[]
{"$rows_left_out":26}
{"sheet":"LGIP Cash Flow Analysis","index":7,"n_rows":22,"n_cols":17,"rows_kept":22,"cut":false,"hidden":false,"merged":[]}
["Local Government Infrastructure Plan"]
["Brisbane City Council",null,null,null,"Input"]
[{"$f":"Coversheet!C8","v":"Effective 10 December 2021"},null,null,null,"Formula"]
[]
[6.1,"LGIP Summary Cash Flow Projections ($,000's)"]
[null,{"$f":"IF('Modelling inputs'!E30=\"Default\",\"Brisbane Adopted Infrastructure Charge Resolution (No.5) 2015\",IF('Modelling inputs'!E30=\"Alternate charge\",\"Alternate charging scenario: \"&'Modelling inputs'!G30,\"ERROR\"))","v":"Brisbane Adopted Infrastructure Charge Resolution (No.5) 2015"}]
[]
[null,"Cost Category","Sub-category",null,"2016 NPV",null,2016,2017,2018,2019,2020,2021,2022,2023,2024,2025,2026]
[null,"Anticipated Cost (Cap X in $'000)","Local Roads",null,1278877.72,null,null,86733.148400000005,86733.148400000005,86733.148400000005,86733.148400000005,86733.148400000005,289329.9032,289329.9032,289329.9032,289329.9032,289329.9032]
[null,null,"Pathway",null,226868.679,null,null,7176.8486000000003,7176.8486000000003,7176.8486000000003,7176.8486000000003,7176.8486000000003,62265.537200000006,62265.537200000006,62265.537200000006,62265.537200000006,62265.537200000006]
[null,null,"Ferry Terminals",null,101255.84699999999,null,null,12006.985400000001,12006.985400000001,12006.985400000001,12006.985400000001,12006.985400000001,16058.738800000001,16058.738800000001,16058.738800000001,16058.738800000001,16058.738800000001]
[null,null,"Public Parks",null,462221.967,null,null,44899.841999999997,44899.841999999997,44899.841999999997,44899.841999999997,44899.841999999997,86513.001199999999,86513.001199999999,86513.001199999999,86513.001199999999,86513.001199999999]
[null,null,"Land for Community Facilities",null,30574.798999999999,null,null,248.71480000000003,248.71480000000003,248.71480000000003,248.71480000000003,248.71480000000003,9348.8858,9348.8858,9348.8858,9348.8858,9348.8858]
[null,null,"Stormwater",null,115902.423,null,null,12029.4352,12029.4352,12029.4352,12029.4352,12029.4352,20666,20666,20666,20666,20666]
[null,null,"Total Network Costs",null,{"$f":"SUM(E9:E14)","v":2215701.4350000001},null,{"$f":"SUM(G9:G14)","v":0},{"$f":"SUM(H9:H14)","v":163094.97440000001},163094.97440000001,163094.97440000001,163094.97440000001,163094.97440000001,484182.0662,484182.0662,484182.0662,484182.0662,484182.0662]
[null,"Anticipated Charges Revenue ($'000)","Residential",null,{"$f":"G16+NPV(WACC,H16:Q16)","v":523242.82341587829},null,{"$f":"'Adopted Charge Revenue Forecast'!F10","v":0},{"$f":"'Adopted Charge Revenue Forecast'!G10","v":76019.600000000006},{"$f":"'Adopted Charge Revenue Forecast'!H10","v":76019.600000000006},{"$f":"'Adopted Charge Revenue Forecast'!I10","v":76019.600000000006},{"$f":"'Adopted Charge Revenue Forecast'!J10","v":76019.600000000006},{"$f":"'Adopted Charge Revenue Forecast'!K10","v":76019.600000000006},{"$f":"'Adopted Charge Revenue Forecast'!L10","v":63819.199999999997},{"$f":"'Adopted Charge Revenue Forecast'!M10","v":63819.199999999997},{"$f":"'Adopted Charge Revenue Forecast'!N10","v":63819.199999999997},{"$f":"'Adopted Charge Revenue Forecast'!O10","v":63819.199999999997},{"$f":"'Adopted Charge Revenue Forecast'!P10","v":63819.199999999997}]
[null,null,"Non-residential",null,290492.16200997325,null,{"$f":"'Adopted Charge Revenue Forecast'!F11","v":0},{"$f":"'Adopted Charge Revenue Forecast'!G11","v":38274.733599999985},{"$f":"'Adopted Charge Revenue Forecast'!H11","v":38274.733599999985},{"$f":"'Adopted Charge Revenue Forecast'!I11","v":38274.733599999985},{"$f":"'Adopted Charge Revenue Forecast'!J11","v":38274.733599999985},{"$f":"'Adopted Charge Revenue Forecast'!K11","v":38274.733599999985},{"$f":"'Adopted Charge Revenue Forecast'!L11","v":40667.287200000006},{"$f":"'Adopted Charge Revenue Forecast'!M11","v":40667.287200000006},{"$f":"'Adopted Charge Revenue Forecast'!N11","v":40667.287200000006},{"$f":"'Adopted Charge Revenue Forecast'!O11","v":40667.287200000006},{"$f":"'Adopted Charge Revenue Forecast'!P11","v":40667.287200000006}]
[null,null,"Non-residential (Stormwater component)",null,30002.748437234364,null,{"$f":"'Adopted Charge Revenue Forecast'!F12","v":0},{"$f":"'Adopted Charge Revenue Forecast'!G12","v":3803.1046367283911},{"$f":"'Adopted Charge Revenue Forecast'!H12","v":3803.1046367283911},{"$f":"'Adopted Charge Revenue Forecast'!I12","v":3803.1046367283911},{"$f":"'Adopted Charge Revenue Forecast'!J12","v":3803.1046367283911},{"$f":"'Adopted Charge Revenue Forecast'!K12","v":3803.1046367283911},{"$f":"'Adopted Charge Revenue Forecast'!L12","v":4400.1069635500608},{"$f":"'Adopted Charge Revenue Forecast'!M12","v":4400.1069635500608},{"$f":"'Adopted Charge Revenue Forecast'!N12","v":4400.1069635500608},{"$f":"'Adopted Charge Revenue Forecast'!O12","v":4400.1069635500608},{"$f":"'Adopted Charge Revenue Forecast'!P12","v":4400.1069635500608}]
[null,null,"Total revenue",null,843737.73386308574,null,{"$f":"SUM(G16:G18)","v":0},{"$f":"SUM(H16:H18)","v":118097.43823672837},118097.43823672837,118097.43823672837,118097.43823672837,118097.43823672837,108886.59416355006,108886.59416355006,108886.59416355006,108886.59416355006,108886.59416355006]
[null,"Annual Cash Flow ($'000)","N/A",null,-1379275.4069594515,null,{"$f":"G19-G15","v":0},{"$f":"H19-H15","v":-44997.536163271638},-44997.536163271638,-44997.536163271638,-44997.536163271638,-44997.536163271638,-375295.47203644994,-375295.47203644994,-375295.47203644994,-375295.47203644994,-375295.47203644994]
{"$rows_left_out":2}